Home > An Internal > An Internal Assertion Error Occurred

An Internal Assertion Error Occurred

Contents

But in unmarshaling response, I face the problem. Confirm and manage identities. Redefining cases command Are there any Postbuses left in the UK? APAR status Closed as program error. navigate here

Dharmendra Yadav replied Jul 1, 2009 thanks, we had the same problem on solaris and you solution worked for us. Has anyone ever encountered this or have an idea on why it happens or how to fix? This does not solve the problem. at org.apache.axis2.jaxws.wrapper.impl.JAXBWrapperToolImpl.unWrap(JAXBWrapperToolImpl.java:84) at org.apache.axis2.jaxws.marshaller.impl.alt.DocLitWrappedMethodMarshaller.demarshalResponse(DocLitWrappedMethodMarshaller.java:144) at org.apache.axis2.jaxws.client.proxy.JAXWSProxyHandler.createResponse(JAXWSProxyHandler.java:440) at org.apache.axis2.jaxws.client.proxy.JAXWSProxyHandler.invokeSEIMethod(JAXWSProxyHandler.java:351) at org.apache.axis2.jaxws.client.proxy.JAXWSProxyHandler.invoke(JAXWSProxyHandler.java:159) at $Proxy46.verify(Unknown Source) A (cut down) extract of the wsdl: https://www.ibm.com/developerworks/community/forums/thread.jspa?messageID=14626923

An Internal Error Has Occurred Assertion Failed

Browse other questions tagged websphere jax-ws or ask your own question. The code has been updated so this problem no longer occurs. Solve problems - It's Free Create your account in seconds E-mail address is taken If this is your account,sign in here Email address Username Between 5 and 30 characters. Compute the Mertens function What are the holes on the sides of a computer case frame for?

Please enter a title. Toolbox for IT My Home Topics People Companies Jobs White Paper Library Collaboration Tools Discussion Groups Blogs Follow Toolbox.com Toolbox for IT on Twitter Toolbox.com on Twitter Toolbox.com on Facebook Topics share|improve this answer answered Jul 28 '15 at 17:55 Süleyman Ünlü 1 add a comment| Your Answer draft saved draft discarded Sign up or log in Sign up using Google More discussions in Business Intelligence Suite Enterprise Edition All PlacesBusiness IntelligenceBusiness Intelligence FoundationBusiness Intelligence Suite Enterprise Edition This discussion is archived 2 Replies Latest reply on Feb 17, 2014 6:57 AM

The web service is called and successful response is returned. When I bumped up to 6, that took care of things. Join us to help others who have the same bug. http://stackoverflow.com/questions/18212488/jaxbwrapperexception-jaxb-object-does-not-have-a-xxxx-xml-property If you agree to our use of cookies, please close this message and continue to use this site.

My girlfriend has mentioned disowning her 14 y/o transgender daughter Can I travel inside the US with a digital copy of my passport and visa? From fresh install under solaris 64-bit. Join them; it only takes a minute: Sign up Web service Unmarshalling response error in WebSphere up vote 0 down vote favorite I'm developing a web service client consumer. Plural of "State of the Union" Train carriages in the Czech Republic What is the meaning of the phrase "in the hands of big money"?

An Internal Error Has Occurred Assertion Failed Lightroom

Once you may want to upgrade your websphere maybe with a fix pack. Top Best Answer 0 Mark this reply as the best answer?(Choose carefully, this can't be changed) Yes | No Saving... An Internal Error Has Occurred Assertion Failed Terry Fanning replied Mar 23, 2010 Hi, Metalink doc 566463.1 looks similar to your problem. IBM has a great article that explains the WSDL to Java mappings: http://publib.boulder.ibm.com/infocenter/wsdoc400/v6r0/index.jsp?topic=/com.ibm.websphere.iseries.doc/info/ae/ae/rwbs_map.html share|improve this answer edited Nov 15 '14 at 20:29 answered Nov 15 '14 at 20:09 Michael Hoffman 1699

Re: Error - Internal Assertion 976425 Feb 17, 2014 6:57 AM (in response to Srini VEERAVALLI) Thanks Srini, Solution: Database - Features - I enabled Distinct Supported feature which was disabled. http://crearesiteweb.net/an-internal/an-internal-tbs-error-was-detected.html Please type your message and try again. 13 Replies Latest reply: Mar 14, 2014 10:37 AM by Balasaravanan Aspects error when running DFS mkinja Apr 1, 2008 1:20 PM Hi,I'm testing All rights reserved. The aspectjrt.jar has the org.aspectj package.

Stack Overflow | radimpe | 3 years ago We do not find any solutions for your query Root Cause Analysis javax.xml.ws.WebServiceException org.apache.axis2.jaxws.wrapper.impl.JAXBWrapperException: An internal assertion error occurred. Accept & Close Sign In Create Account Search among 0 solutions Search Your bugs help others We want to create amazing apps without being stopped by crashes. Second thing i'd recommend is that you could switch your websphere running mode. http://crearesiteweb.net/an-internal/an-internal-error-occurred-while-showing-an-internal-error.html Metalink details are: Symptoms Customer took an older version of the RPD, opened it offline, performed a global consistency check, and saved the file.

Should I include him as author? I changed the class loading attribute of project to parent last, also disabled WebSphere Web Service by putting the flag "DisableIBMJAXWSEngine: true" in manifest file of project, but nothing changed. Re: Aspects error when running DFS mkinja Apr 2, 2008 12:21 PM (in response to Fabian Lee, EMC) Hi,I tried what you said but i get this error now:com.emc.documentum.fs.rt.ServiceInvocationException: Could not

The Siebel Analytics group is no longer active.

asked 3 years ago viewed 2127 times active 3 years ago Related 2JAXB - marshal object with XML string property2Combine JAXB and JAXWS for an imported XML Schema2JAXB-AXIS, When request xml Join them; it only takes a minute: Sign up JAXBWrapperException: JAXB object does not have a XXXX xml property up vote 0 down vote favorite I get the following error: [8/13/13 developerWorks Maintenance Updates Connect with IBM developerWorksdeveloperWorks on FacebookdeveloperWorks on TwitterdeveloperWorks on LinkedIndeveloperWorks on YouTubedeveloperWorks on Google+ United States English English IBM® Site map The Siebel Analytics group is no longer active. 2018897 Related Discussions Internal Assertion Error 46036 Internal assertion error.[nQSError: 46036] [nQSError:46036] Internal Assertion OBIEE 10g Internal Assertion Error sourceLevelID != kNull_LevelID Error

Do I send relative's resume to recruiters when I don't exactly support the candidate's track record? Cheers Terry Top For discussions on Siebel Analytics please visit the Oracle BI group. What is this cable hanging against the outer wall? weblink Show 2 replies 1.

Then, when they go to save the changes. Sincerely. –Rassul Nov 16 '14 at 13:54 I understand. Report Abuse Like Show 0 Likes (0) 8. Code: 10058. [NQODBC] [SQL_STATE: HY000] [nQSError: 10058] A general error has occurred. [nQSError: 43113] Message returned from OBIS. [nQSError: 43119] Query Failed: [nQSError: 46008] Internal error: File server\Query\Optimizer\ServiceInterfaceMgr\Src\SQOIGeneratorBuiltIn.cpp, line 770.Please have

DailyProgrammer 284: Wandering Fingers Why do we not require websites to have several independent certificates? You can not post a blank message. more stack exchange communities company blog Stack Exchange Inbox Reputation and Badges sign up log in tour help Tour Start here for a quick overview of the site Help Center Detailed Check the imports at the top of your file and verify, you can also use the fully qualified class name which will be better while we are troubleshooting.

Wild Might replied May 30, 2008 have you been able to resolve the issue? All rights reserved.PrivacyLegalContactUnited StatesProductsSolutionsShopSupportServicesPartnersCompanyMy AccountLog InBROWSE PRODUCTSStorageServersConverged InfrastructureData ProtectionSecurityNetworkingContent ManagementDell Products for WorkSearch Products by NameProducts A-ZShop EMC ProductsProduct CommunitySoftware DownloadsLive ChatContact SalesCall 1-866-438-3622Call 1-866-438-3622Storage CategoriesOverviewEnterpriseEntry & MidrangeSoftware DefinedAll-FlashCloudManagement & NetworkingStorage