Home > An Error > An Error Has Occurred While Processing The Maven Artifact Tasks

An Error Has Occurred While Processing The Maven Artifact Tasks

Hide Permalink Steve Rowe added a comment - 22/Nov/10 13:50 Hi Drew, I tried running ant generate-maven-artifacts without your patch, and I see the same failure as you do. (Actually, when Return code is: 401 BUILD FAILED I've tried adding wagon-http, wagon-webdav, etc. Join them; it only takes a minute: Sign up Dependency Issue up vote 0 down vote favorite I am trying to use Maven in Ant using the Maven Ant Tasks. Thanks for reporting. Source

Atlassian Linked ApplicationsLoading… DashboardsProjectsIssuesAgile Help Online Help JIRA Agile Help JIRA Service Desk Help Keyboard Shortcuts About JIRA JIRA Credits What’s New Log In Export Tools Lucene - CoreLUCENE-2774ant generate-maven-artifacts target Are there any Postbuses left in the UK? I've double-checked that your beryx user id has deployer access to net.sourceforge.rapidprops. Diagnosis: Error deploying artifact 'org.apache.tapestry:plastic:jar': Error deploying artifact: Authorization failed: Access denied to: https://repository.apache.org/service/local/staging/deploy/maven2/org/apache/tapestry/plastic/5.4-beta-21/plastic-5.4-beta-21.jar :plastic:uploadPublished FAILED :plastic:uploadPublished (Thread[main,5,main]) completed.

Everything works. Will commit when tests pass. maven ant nexus maven-ant-tasks share|improve this question edited Dec 11 '12 at 18:36 asked Dec 11 '12 at 17:48 Noremac 1,80732046 add a comment| 2 Answers 2 active oldest votes up

Everything from public repo is downloaded, but custom lib is not. although I do not think this should be necessary (at least according to the docs) Hide Permalink Howard M. Cycles ignores smooth Rosa Parks is a [symbol?] for the civil rights movement?

Show Brian Fox added a comment - 10/Sep/14 22:54 There's no upgrade that has taken place. Eventually these class definitions fill up the PermGen space and cause an OOM error. I'll leave this issue open until all of the nightly Hudson builds have succeeded (hopefully that will happen tonight). by logging on to the repository.apache.org.

maven-publish-artifact: [artifact:install-provider] Installing provider: org.apache.maven.wagon:wagon-http:jar:1.0-beta-2:runtime [artifact:deploy] Deploying to https://repository.apache.org/content/repositories/staging [artifact:deploy] Uploading: org/apache/hive/hive-anttasks/0.8.0/hive-anttasks-0.8.0.jar to repository apache.staging.https at https://repository.apache.org/content/repositories/staging [artifact:deploy] Transferring 9K from apache.staging.https [artifact:deploy] An error has occurred while processing the Maven It also looks like we should be pushing this to the staging repository as opposed to the releases repository. Do you have the same problem when deploying a release version? Proving if it is possible to write 1 as the sum of the reciprocals of x odd integers Where do I find online bookshelves with ebooks or PDFs written in Esperanto?

but this one is too > crufty for me... additional hints Hide Permalink Joel Orlina added a comment - 12/31/12 06:08 PM User has confirmed as settings issue, so I'm resolving as "Not A Bug." Show Joel Orlina added a comment - Hide Permalink Uwe Schindler added a comment - 22/Nov/10 14:10 - edited Hi, ANT 1.8 is not recommeneded for Lucene builds, some specials in Lucene do not work correctly, because some Show Giridharan Kesavan added a comment - 29/Jul/11 17:02 can someone try the following command with credentials in the .m2/settings.xml and post the output? ( I don't have repo access to

I'm having problems deploying to our internal repository (which is using nexus) To try and resolve this I created a stripped down ant build like so: http://crearesiteweb.net/an-error/an-error-has-occurred-during-report-processing.html https://issues.apache.org/jira/browse/HIVE-2243 Diffs (updated) ant/build.xml 17b3c3a build-common.xml 9a738c9 build.xml 13b09c1 cli/build.xml add53e1 common/build.xml e8a0712 contrib/build.xml cf1711c hbase-handler/build.xml 4990b13 hwi/build.xml 76bffa8 jdbc/build.xml 9d9a59e metastore/build.xml 7f01f91 odbc/build.xml db9f4af pdk/build.xml b1f6ed4 ql/build.xml ca8ba86 serde/build.xml 51ac8dd Return code is: 401 Thank you! Hide Permalink John Sichi added a comment - 04/Oct/11 22:43 (Tests have been passing fine for me on the same box without this change.) Show John Sichi added a comment -

Not the answer you're looking for? How to write down a note that is sustained while there are other simultaneous in the same bar? Please note that I had to move several taskdefs from build-common.xml to build.xml in order to avoid OOM errors. have a peek here Hide Permalink [email protected] added a comment - 03/Oct/11 20:58 ----------------------------------------------------------- This is an automatically generated e-mail.

Apparently Ant 1.8.X no longer pays attention to jars in $ANT_HOME/lib/?) However, after applying your patch, the build still fails on trunk (haven't tried branch_3x yet), though not with the same Free forum by Nabble Edit this page Linked ApplicationsLoading… DashboardsProjectsIssuesCaptureGetting startedAgile Help Online Help JIRA Agile Help Keyboard Shortcuts About JIRA JIRA Credits Log In Export Tools Community Support - Open To reply, visit: https://reviews.apache.org/r/2153/ ----------------------------------------------------------- (Updated 2011-10-07 08:08:55.722617) Review request for hive and John Sichi.

With this patch in place I verified that I am able to publish to the snapshot and staging repositories as follows: % ant maven-build -Dmvn.publish.repo=snapshots % ant maven-publish -Dmvn.publish.repo=snaphots % ant

I have been able to install/dependencies custom libraries to a local repo (Artifactory) and have been able to get dependencies (from public repos and local). share|improve this answer edited Feb 14 '13 at 15:47 answered Dec 13 '12 at 0:15 Noremac 1,80732046 add a comment| up vote 0 down vote This appears to be solved in Reload to refresh your session. Return code is: 400 [artifact:deploy] BUILD FAILED C:\Users\11_1_15\build.xml:561: The following error occurred while executing this line: C:\Users\11_1_15\build.xml:551: Error deploying artifact 'com.xactsites:shared-resources:war': Error deploying artifact: Failed to transfer file: http://${nexusIP}:8081/nexus/content/groups/public/com/xactsites/shared-resources/13.1.19-SNAPSHOT/shared-resources-13.1.19-20121211.172831-28.war.

People Assignee: Unassigned Reporter: Howard M. Reassigning to you. Show Amareshwari Sriramadasu added a comment - 01/Aug/11 10:54 I'm not able run the command successfully. http://crearesiteweb.net/an-error/an-error-occurred-while-processing-the-directive.html There are some warnings and errors about missing artifacts, but the JARs are built correctly - so not fatal - that was always the case and we dont want to touch

Normally I would just convert the build to Maven... HTH Hide Permalink Robert Muir added a comment - 27/Dec/10 02:15 i know, i'm re-opening a maven issue! Verified that the jar, package, and test targets still work. Hide Permalink Brian Fox added a comment - 10/Sep/14 22:54 There's no upgrade that has taken place.

Kind regards Karl-Heinz Marbaise Hide Permalink Andy Gumbrecht added a comment - 10/Sep/14 18:51 Same for Apache TomEE Access denied to: https://repository.apache.org Show Andy Gumbrecht added a comment - 10/Sep/14 18:51 Can't publish maven release artifacts to apache repository (Carl Steinbach via jvs) jvs : http://svn.apache.org/viewcvs.cgi/?root=Apache-SVN&view=rev&rev=1181187 Files : /hive/trunk/ant/build.xml /hive/trunk/build-common.xml /hive/trunk/build.xml /hive/trunk/cli/build.xml /hive/trunk/common/build.xml /hive/trunk/contrib/build.xml /hive/trunk/hbase-handler/build.xml /hive/trunk/hwi/build.xml /hive/trunk/jdbc/build.xml /hive/trunk/metastore/build.xml /hive/trunk/odbc/build.xml /hive/trunk/pdk/build.xml /hive/trunk/ql/build.xml /hive/trunk/serde/build.xml asked 4 years ago viewed 264 times active 4 years ago Related 497How do I tell Maven to use the latest version of a dependency?36Maven or Ivy for Managing Dependencies from Show Steve Rowe added a comment - 23/Jan/11 17:12 All nightlies succeeded last night - resolving.

Activity All Comments Work Log History Activity Ascending order - Click to sort in descending order Hide Permalink Joel Orlina added a comment - 12/28/12 03:43 PM I confess I haven't Thanks, Carl Show [email protected] added a comment - 03/Oct/11 20:58 ----------------------------------------------------------- This is an automatically generated e-mail. I took another look at the Apache "Publishing Maven Artifacts" guide (http://www.apache.org/dev/publishing-maven-artifacts.html) and think that we're probably failing to include a couple fields that are required in the pom files. BUILD FAILED Total time: 38.061 secs ~/workspaces/t5 $ I can't find any details on apache.org or sonatype.com about the upgrade; i.e., what I need to change in my build/configuration to continue

There are some warnings and errors about missing artifacts, but the JARs are built correctly - so not fatal - that was always the case and we dont want to touch THanks for the support. I suspect that the 'typefound' task in the 'ivy-probe-antlib' target has a bug, or that it doesn't work as expected when called via ant/subant/antcall tasks. https://issues.apache.org/jira/browse/HIVE-2243 Diffs build-common.xml 9a738c9 build.xml 13b09c1 contrib/build.xml cf1711c hbase-handler/build.xml 4990b13 ql/build.xml ca8ba86 Diff: https://reviews.apache.org/r/2153/diff Testing ------- Verified that I can publish maven artifacts to the snapshot and staging repos.

Atlassian Maven › Maven - Users Search everywhere only in this topic Advanced Search Maven-Ant-Tasks and deploy ‹ Previous Topic Next Topic › Classic List Threaded ♦ ♦ Locked 2 Show Howard M. When I use maven-ant-tasks-2.0.9.jar with Ant 1.7.1 locally, and the equivalent of Drew's patches (since the POM parents have changed), I see the same errors, but the build doesn't fail. share|improve this answer answered Jul 25 '12 at 13:53 Sean 168318 add a comment| Your Answer draft saved draft discarded Sign up or log in Sign up using Google Sign

The error i get is: [artifact:dependencies] An error has occurred while processing the Maven artifact tasks. [artifact:dependencies] Diagnosis: [artifact:dependencies] [artifact:dependencies] Unable to resolve artifact: Missing: [artifact:dependencies] ---------- [artifact:dependencies] 1) xxx.yyy:zzz:jar:0.0.2 The Reload to refresh your session.